آخرین فعالیت ٣ هفته پیش

@saeid4x

پارس کلیکی از ۶ ماه پیش

تجربه

2000

  • @psobhanlo

    ممنونم از نظرت . در مورد سایت های فریلنسری ایرانی باید بگم که به احتمال زیاد اکثر پروژه هایی که تو این سایت ها تعریف میشن پروژه های واقعی نیست و این سایت ها برای اینکه پول عضویت ویژه از فریلنسر بگبرن، این پروژه های فیک رو تعریف می کنن.نمونش همین سایتیه که الان معروفه!.

    ولی منظور من کار فریلنسری نیست.بعضی سایت های کاریابی خارجی رو اگه نگاه کنی تو عناوین شغلیش عبارت remote روآورده یعنی یه رزومه ازت می گیرن و اگه ok بود باهات قرارداد می بندن و میشی کارمند اونا..

    سوال من اینه که آیا اصلا همچین چیزی واقعیه؟تا حالا کسی با این شرکت ها کار کرده؟ و آیا بهشون میشه اعتماد کرد؟

  • سلام دوستان

    من در حال حاضر دانشجویم و همزمان دارم کار برنامه نویسی و همچنین ترجمه برای چند سایت انجام میدم.هدفم اینه که بعد از اینکه کارشناسیم رو گرفتم بیام خارج (که سال 99 می گیرم) .می خوام بدونم آیا امکانش هست تو این مدت که تو ایرانم به صورت ریموت برای شرکتهای خارجی کار کنم؟چطور باید این شرکتها رو پیدا کنم؟ و آیا قابل اعتمادند؟

    اینو بگم که در حال حاضر رو زبان ژاپنیم کار میکنم و قصد دارم برم ژاپن..ولی فعلا برای دورکاری تو شرکت انگلیسی زبان می خوام کار کنم

    ممنون

  • ۴ ماه پیش @saeid4x به بحث پادکست جواب داد.

    @amir

    در مورد مهاجرت کاری، کار ریموت ار داخل ایران برای شرکت های خارجی، در مورد کار و تحصیل به طور همزمان در خارج کشور

  • سلام دوستان

    من می خام ریکت نیتیو رو تو شبیه ساز اندروید اجرا کنم ، اما موقع اجرا خطای زیر رو تو CMD نشون میده لطفا بگید چطور این مشکل رو حل کنم؟؟

    در ضمن از مراحل زیر برای نصب استفاده کردم:

    react-native init AwesomeProject
    cd AwesomeProject
    react-native run-android

    اما پس از اجرای دستور آخر خطای زیر تو CMD ظاهر میشه:

    
    FAILURE: Build failed with an exception.
    
    * What went wrong:
    A problem occurred configuring root project 'AwesomeProject۱۰'.
    > Could not resolve all files for configuration ':classpath'.
       > Could not download builder-model.jar (com.android.tools.build:builder-model:۲.۳.۳)
          > Could not get resource 'https://jcenter.bintray.com/com/android/tools/build/builder-model/۲.۳.۳/builder-model-۲.۳.۳.jar'.
             > Could not GET 'https://jcenter.bintray.com/com/android/tools/build/builder-model/۲.۳.۳/builder-model-۲.۳.۳.jar'.
                > Connect to jcenter.bintray.com:۴۴۳ [jcenter.bintray.com/۱۰۸.۱۶۸.۲۴۳.۱۵۰] failed: Connection timed out: connect
       > Could not download builder-test-api.jar (com.android.tools.build:builder-test-api:۲.۳.۳)
          > Could not get resource 'https://jcenter.bintray.com/com/android/tools/build/builder-test-api/۲.۳.۳/builder-test-api-۲.۳.۳.jar'.
             > Could not GET 'https://jcenter.bintray.com/com/android/tools/build/builder-test-api/۲.۳.۳/builder-test-api-۲.۳.۳.jar'.
                > Connect to jcenter.bintray.com:۴۴۳ [jcenter.bintray.com/۱۰۸.۱۶۸.۲۴۳.۱۵۰] failed: Connection timed out: connect
       > Could not download sdklib.jar (com.android.tools:sdklib:۲۵.۳.۳)
          > Could not get resource 'https://jcenter.bintray.com/com/android/tools/sdklib/۲۵.۳.۳/sdklib-۲۵.۳.۳.jar'.
             > Could not GET 'https://jcenter.bintray.com/com/android/tools/sdklib/۲۵.۳.۳/sdklib-۲۵.۳.۳.jar'.
                > Connect to jcenter.bintray.com:۴۴۳ [jcenter.bintray.com/۱۰۸.۱۶۸.۲۴۳.۱۵۰] failed: Connection timed out: connect
       > Could not download sdk-common.jar (com.android.tools:sdk-common:۲۵.۳.۳)
          > Could not get resource 'https://jcenter.bintray.com/com/android/tools/sdk-common/۲۵.۳.۳/sdk-common-۲۵.۳.۳.jar'.
             > Could not GET 'https://jcenter.bintray.com/com/android/tools/sdk-common/۲۵.۳.۳/sdk-common-۲۵.۳.۳.jar'.
                > Connect to jcenter.bintray.com:۴۴۳ [jcenter.bintray.com/۱۰۸.۱۶۸.۲۴۳.۱۵۰] failed: Connection timed out: connect
    
      Try:
    Run with --stacktrace option to get the stack trace. Run with --info or --debug option to get more log output.
    
    BUILD FAILED
    
    Total time: ۱ mins ۴۶.۲۴۵ secs
    Could not install the app on the device, read the error above for details.
    Make sure you have an Android emulator running or a device connected and have
    set up your Android development environment:
    https://facebook.github.io/react-native/docs/getting-started.html
    
    NDK is missing a "platforms" directory.
    If you are using NDK, verify the ndk.dir is set to a valid NDK directory.  It is currently set to C:\Users\saeid\AppData\Local\Android\Sdk\ndk-bundle.
    If you are not using NDK, unset the NDK variable from ANDROID_NDK_HOME or local.properties to remove this warning.
    
    Observed package id 'tools' in inconsistent location 'C:\Users\saeid\AppData\Local\Android\Sdk\__tools' (Expected 'C:\Users\saeid\AppData\Local\Android\Sdk\tools')
    java.io.FileNotFoundException: https://dl.google.com/android/repository/repository2-1.xml
    Failed to download any source lists!
    
    FAILURE: Build failed with an exception.
    
    * What went wrong:
    A problem occurred configuring project ':app'.
    > Failed to find Build Tools revision 26.0.3
    
    * Try:
    Run with --stacktrace option to get the stack trace. Run with --info or --debug option to get more log output.
    
    BUILD FAILED
    
    Total time: 22.903 secs
    Could not install the app on the device, read the error above for details.
    Make sure you have an Android emulator running or a device connected and have
    set up your Android development environment:
    https://facebook.github.io/react-native/docs/getting-started.html
    
  • ۵ ماه پیش @saeid4x یک بحث به اسم مشکل در نصب و راه اندازی React Native درست کرد.

    سلام دوستان

    من می خوام React Native رو شروع کنم .سایت رسمیش رفتم و دستورالعمل نصبش رو مو به مو اجرا کردم،حتی از فیلم های آموزشی کمک گرفتم اما متاسفانه هنوز نتونستم راه اندازیش کنم. و موقع زدن دستور react-native run-android یا npm start خطای زیر رو میده... در ضمن npmو پایتون3 از قبل نصب کرده بودم

    
    > AwesomeProject@0.0.1 start D:\myProject\reactNative\AwesomeProject
    > node node_modules/react-native/local-cli/cli.js start
    
    D:\myProject\reactNative\AwesomeProject\node_modules\react-native\local-cli\server\checkNodeVersion.js:43
        );
        ^
    SyntaxError: Unexpected token )
        at createScript (vm.js:56:10)
        at Object.runInThisContext (vm.js:97:10)
        at Module._compile (module.js:542:28)
        at Object.Module._extensions..js (module.js:579:10)
        at Module.load (module.js:487:32)
        at tryModuleLoad (module.js:446:12)
        at Function.Module._load (module.js:438:3)
        at Module.require (module.js:497:17)
        at require (internal/module.js:20:19)
        at Object.<anonymous> (D:\myProject\reactNative\AwesomeProject\node_modules\react-native\local-cli\cli.js:17:1)
    
    npm ERR! Windows_NT 10.0.14393
    npm ERR! argv "C:\\Program Files\\nodejs\\node.exe" "C:\\Program Files\\nodejs\\node_modules\\npm\\bin\\npm-cli.js" "start"
    npm ERR! node v6.11.1
    npm ERR! npm  v3.10.10
    npm ERR! code ELIFECYCLE
    npm ERR! AwesomeProject@0.0.1 start: `node node_modules/react-native/local-cli/cli.js start`
    npm ERR! Exit status 1
    npm ERR!
    npm ERR! Failed at the AwesomeProject@0.0.1 start script 'node node_modules/react-native/local-cli/cli.js start'.
    npm ERR! Make sure you have the latest version of node.js and npm installed.
    npm ERR! If you do, this is most likely a problem with the AwesomeProject package,
    npm ERR! not with npm itself.
    npm ERR! Tell the author that this fails on your system:
    npm ERR!     node node_modules/react-native/local-cli/cli.js start
    npm ERR! You can get information on how to open an issue for this project with:
    npm ERR!     npm bugs AwesomeProject
    npm ERR! Or if that isn't available, you can get their info via:
    npm ERR!     npm owner ls AwesomeProject
    npm ERR! There is likely additional logging output above.
    
    npm ERR! Please include the following file with any support request:
    npm ERR!     D:\myProject\reactNative\AwesomeProject\npm-debug.log
    

    لطفا بگید چطور مشکل رو رفع کنم؟و برای نصب و راه اندازی ساده تر چه راهی رو پیشنهاد میدید؟

  • ۵ ماه پیش @saeid4x به بحث شروع برنامه نویسی وب جواب داد.

    به نظرم اول یه مقدماتی رو از php یاد بگیر بعد برو سمت فریم ورک هاش مثل لاراول که الان رو بورسه!...

  • کد قسمت کنترلر رو بزار شاید بتونم کمکت کنم

  • بهترین راه استفاده از موتور بازی یونیتیه.. آموزشش به وفور پیدا میشه.می تونی بازیت رو یه باز بسازی و تحت پلتفرم های مختلف(تحت وب، موبایل، دسکتاب، ایکس باکس و...) خروجی بگیری

  • درست شد..خدا خیرت بده چند روز دنبال همین بودم

  • درسته من تو کد اصلی بصورت جمع نوشتم اما تو اینجا singular

    مشکل من اینه که نمی دونم چطور باید loop کنم .. کد زیر رو می نویسم اما خطا می گیرم:

    تو کنترلر:

    $category=category::with('posts')->where('title','=','پادکست')->get();
    
    return view('Posts.show',compact('category'));

    الان این کد رو با tinker ازمایش می کنم همه چیز درسته اما تو ویو خطا می گیره..

    تو ویو زیر کد رو می نویسم اما موقع اجرا میگه که title رو نمیشناسم..چطور باید عنوان هر پست به علاوه دسته بندی هر پست را تو ویو نمایش بدم..اگه کدش رو بگی ممنون میشم.

    @foreach($category as $cat)
        {{'{{'}}$cat->posts->title}}
    @endforeach
  • سلام من دارم روی یک طراحی یک وبلاگ خیلی ساده کار می کنم.دو جدول به نام post و category دارم که فیلداش مثل زیر است: (این دو جدول رابطه many2many دارد)

    post

    id:increment
    author:string
     .....

    category

    id:increment
    title:string

    and pivot table

    id:increment
    post_id:integer
    category_id:integer

    و کد مدل ها:

    post.php

    public function category()
    {
        return $this->belongsToMany(Category::class);
    }

    category.php

    public function post()
    {
        return $this->belongsToMany(post::class)
    }

    حالا می خوام همه پست های یک category خاص را بگیرم باید از چه کدی تو کنترلر و ویو استفاده کنم؟